{"text_format":"1","workbook":"xlsx","n_sheets":9,"sheets":["Inputs","Breakdowns","Breakdowns_Over2000","PrizeList","Signatures","MailMerge","Bank_Table","Bank_Exhibit","Bank_Calc"],"not_rendered":{"charts":0,"images":3,"macros":1,"external_links":0,"defined_names":4,"comments":0,"pivot_tables":0},"unopened":[],"bounds":{"document_bytes":16777216,"sheet_cells":100000,"rows_first":2000,"rows_last":500,"rows_between":2000,"halvings":0,"cell_chars":16384,"cell_head_chars":4096},"cells_cut":0,"cells_raw":0,"read":"whole","date_system":"1900"}

{"sheet":"Inputs","index":0,"n_rows":20,"n_cols":6,"rows_kept":20,"cut":false,"hidden":false,"merged":[]}
[]
[]
[null,null,null,null,"Event Name:","Enter event name here…"]
[]
[]
[]
[]
[]
[]
[]
[null,"This template can be used as a starting point for your Prize Distribution and Race Signatures documents."]
[null,"These sheets are not required formats; feel free to adjust to suit your specific needs."]
[]
[null,"*","Enter event name above."]
[null,"*","The 'Breakdowns' tab contains suggested payout breakdowns for various purse levels."]
[null,"*","Enter the payout for each placing in the 'PrizeList' tab."]
[null,"*","Amounts from the 'PrizeList' tab will carry over to the 'Signatures' tab."]
[null,"*","The 'MailMerge' tab will be populated with data for label/envelope mail merges."]
[]
[null,null,"Program Version:  03/03/2014"]

{"sheet":"Breakdowns","index":1,"n_rows":132,"n_cols":24,"rows_kept":132,"cut":false,"hidden":false,"merged":[]}
[]
["Sample Payout Breakdowns"]
[null,null,null,null,null,null,null,null,null,null,null,null,null,null,null,null,null,null,null,null,null,null,null,{"$f":"\" / \"","v":" / "}]
["Total","Places","Total","1st","2nd","3rd","4th","5th","6th","7th","8th","9th","10th","11th","12th","13th","14th","15th","16th","17th","18th","19th","20th","Payout String"]
[50,2,{"$f":"SUM(D5:W5)","v":50},30,20,null,null,null,null,null,null,null,null,null,null,null,null,null,null,null,null,null,null,{"$f":"implode(D5:W5,$X$3)","v":"30 / 20"}]
[{"$f":"+A5","v":50},3,{"$f":"SUM(D6:W6)","v":50},25,15,10,null,null,null,null,null,null,null,null,null,null,null,null,null,null,null,null,null,{"$f":"implode(D6:W6,$X$3)","v":"25 / 15 / 10"}]
[75,2,75,50,25,null,null,null,null,null,null,null,null,null,null,null,null,null,null,null,null,null,null,"50 / 25"]
[{"$f":"+A7","v":75},3,75,35,25,15,null,null,null,null,null,null,null,null,null,null,null,null,null,null,null,null,null,"35 / 25 / 15"]
[{"$f":"+A8","v":75},4,75,30,20,15,10,null,null,null,null,null,null,null,null,null,null,null,null,null,null,null,null,"30 / 20 / 15 / 10"]
[100,2,100,65,35,null,null,null,null,null,null,null,null,null,null,null,null,null,null,null,null,null,null,"65 / 35"]
[{"$f":"+A10","v":100},3,100,50,30,20,null,null,null,null,null,null,null,null,null,null,null,null,null,null,null,null,null,"50 / 30 / 20"]
[{"$f":"+A11","v":100},4,100,40,30,20,10,null,null,null,null,null,null,null,null,null,null,null,null,null,null,null,null,"40 / 30 / 20 / 10"]
[{"$f":"+A12","v":100},5,100,35,25,20,10,10,null,null,null,null,null,null,null,null,null,null,null,null,null,null,null,"35 / 25 / 20 / 10 / 10"]
[125,3,125,55,40,30,null,null,null,null,null,null,null,null,null,null,null,null,null,null,null,null,null,"55 / 40 / 30"]
[{"$f":"+A14","v":125},4,125,50,35,25,15,null,null,null,null,null,null,null,null,null,null,null,null,null,null,null,null,"50 / 35 / 25 / 15"]
[{"$f":"+A15","v":125},5,125,50,30,20,15,10,null,null,null,null,null,null,null,null,null,null,null,null,null,null,null,"50 / 30 / 20 / 15 / 10"]
[150,3,150,70,50,30,null,null,null,null,null,null,null,null,null,null,null,null,null,null,null,null,null,"70 / 50 / 30"]
[{"$f":"+A17","v":150},4,150,60,40,30,20,null,null,null,null,null,null,null,null,null,null,null,null,null,null,null,null,"60 / 40 / 30 / 20"]
[{"$f":"+A18","v":150},5,150,55,35,25,20,15,null,null,null,null,null,null,null,null,null,null,null,null,null,null,null,"55 / 35 / 25 / 20 / 15"]
[{"$f":"+A19","v":150},6,150,45,35,25,20,15,10,null,null,null,null,null,null,null,null,null,null,null,null,null,null,"45 / 35 / 25 / 20 / 15 / 10"]
[175,3,175,80,55,40,null,null,null,null,null,null,null,null,null,null,null,null,null,null,null,null,null,"80 / 55 / 40"]
[175,4,175,70,50,35,20,null,null,null,null,null,null,null,null,null,null,null,null,null,null,null,null,"70 / 50 / 35 / 20"]
[{"$f":"+A22","v":175},5,175,65,45,35,20,10,null,null,null,null,null,null,null,null,null,null,null,null,null,null,null,"65 / 45 / 35 / 20 / 10"]
[{"$f":"+A23","v":175},6,175,60,40,30,20,15,10,null,null,null,null,null,null,null,null,null,null,null,null,null,null,"60 / 40 / 30 / 20 / 15 / 10"]
[200,4,200,75,55,40,30,null,null,null,null,null,null,null,null,null,null,null,null,null,null,null,null,"75 / 55 / 40 / 30"]
[{"$f":"+A25","v":200},5,200,70,50,40,25,15,null,null,null,null,null,null,null,null,null,null,null,null,null,null,null,"70 / 50 / 40 / 25 / 15"]
[{"$f":"+A26","v":200},6,200,60,45,35,25,20,15,null,null,null,null,null,null,null,null,null,null,null,null,null,null,"60 / 45 / 35 / 25 / 20 / 15"]
[{"$f":"+A26","v":200},7,200,55,40,35,25,20,15,10,null,null,null,null,null,null,null,null,null,null,null,null,null,"55 / 40 / 35 / 25 / 20 / 15 / 10"]
[{"$f":"+A27","v":200},8,200,50,40,30,25,20,15,10,10,null,null,null,null,null,null,null,null,null,null,null,null,"50 / 40 / 30 / 25 / 20 / 15 / 10 / 10"]
[225,4,225,85,60,45,35,null,null,null,null,null,null,null,null,null,null,null,null,null,null,null,null,"85 / 60 / 45 / 35"]
{"$rows_left_out":103}
{"sheet":"Breakdowns_Over2000","index":2,"n_rows":50,"n_cols":6,"rows_kept":50,"cut":false,"hidden":true,"merged":[]}
["This rule is no longer applicable and has been removed from the USA Cycling rulebook."]
[]
[null,"This exhibit can be used to check for compliance with rule 1L3(b) in the USAC rulebook"]
[null,"and should be used for purses over $2,000.  Payouts should go at least 20 places deep."]
[]
[null,"The following example shows several paying positions that do not meet the requirements of rule 1L3(b)."]
[]
[]
[null,"Total Purse ==>",null,{"$f":"SUM(D11:D50)","v":1798.869828571841},{"$f":"SUM(E11:E50)","v":2090}]
[null,"Place","Minimum % of 1st Place","Minimum Payout","Actual Payout"]
[null,1,null,{"$f":"+E11","v":500},500,{"$f":"IF(E11<D11,\" <== ERROR\",\"\")","v":""}]
[null,{"$f":"+B11+1","v":2},{"$f":"IF(B12<=20,1/B12,0)","v":0.5},{"$f":"IF(E12>0,D$11*$C12,\"\")","v":250},225,{"$f":"IF(AND(E12<D12,E12>0),\" <== ERROR\",\"\")","v":" <== ERROR"}]
[null,3,0.33333333333333331,166.66666666666666,200,""]
[null,4,0.25,125,175,""]
[null,5,0.2,100,150,""]
[null,6,0.16666666666666666,83.333333333333329,125,""]
[null,7,0.14285714285714285,71.428571428571431,100,""]
[null,8,0.125,62.5,90,""]
[null,9,0.1111111111111111,55.55555555555555,80,""]
[null,10,0.1,50,70,""]
[null,11,9.0909090909090912E-2,45.454545454545453,60,""]
[null,12,8.3333333333333329E-2,41.666666666666664,50,""]
[null,13,7.6923076923076927E-2,38.461538461538467,40,""]
[null,14,7.1428571428571425E-2,35.714285714285715,30," <== ERROR"]
[null,15,6.6666666666666666E-2,33.333333333333336,20," <== ERROR"]
[null,16,6.25E-2,31.25,20," <== ERROR"]
[null,17,5.8823529411764705E-2,29.411764705882351,20," <== ERROR"]
[null,18,5.5555555555555552E-2,27.777777777777775,20," <== ERROR"]
[null,19,5.2631578947368418E-2,26.315789473684209,20," <== ERROR"]
[null,20,0.05,25,20," <== ERROR"]
{"$rows_left_out":21}
{"sheet":"PrizeList","index":3,"n_rows":26,"n_cols":22,"rows_kept":26,"cut":false,"hidden":false,"merged":[]}
[null,{"$f":"+Inputs!$F$3","v":"Enter event name here…"}]
[null,"Payout Distribution"]
[]
[null,"Race",null,"Prizes",null,null,null,1,{"$f":"+H4+1","v":2},{"$f":"+I4+1","v":3},4,5,6,7,8,9,10,11,12,13,14,15]
[]
[null,"Pro/1/2",null,{"$f":"SUM(H6:W6)","v":0},"/",{"$f":"COUNT(H6:W6)","v":0}]
[null,"Cat 2 Bonus",null,{"$f":"SUM(H7:W7)","v":0},"/",{"$f":"COUNT(H7:W7)","v":0}]
[]
[null,"Cat 3",null,{"$f":"SUM(H9:W9)","v":0},"/",{"$f":"COUNT(H9:W9)","v":0}]
[]
[null,"Cat 4",null,{"$f":"SUM(H11:W11)","v":0},"/",{"$f":"COUNT(H11:W11)","v":0}]
[]
[null,"Cat 5",null,"Age Group Medals 3 Deep  (19-29, 30-39, 40+)"]
[]
[null,"Masters 30+/40+",null,{"$f":"SUM(H15:W15)","v":0},"/",{"$f":"COUNT(H15:W15)","v":0}]
[null,"Masters 40+ Bonus",null,{"$f":"SUM(H16:W16)","v":0},"/",{"$f":"COUNT(H16:W16)","v":0}]
[null,"Masters 50+/60+",null,{"$f":"SUM(H17:W17)","v":0},"/",{"$f":"COUNT(H17:W17)","v":0}]
[null,"Masters 60+ Bonus",null,{"$f":"SUM(H18:W18)","v":0},"/",{"$f":"COUNT(H18:W18)","v":0}]
[]
[null,"Juniors",null,{"$f":"SUM(H20:W20)","v":0},"/",{"$f":"COUNT(H20:W20)","v":0}]
[]
[null,"Women 1/2/3",null,{"$f":"SUM(H22:W22)","v":0},"/",{"$f":"COUNT(H22:W22)","v":0}]
[null,"Women 4",null,{"$f":"SUM(H23:W23)","v":0},"/",{"$f":"COUNT(H23:W23)","v":0}]
[]
[]
[null,"Total Purse:",null,{"$f":"SUM(D5:D24)","v":0}]

{"sheet":"Signatures","index":4,"n_rows":216,"n_cols":3,"rows_kept":216,"cut":false,"hidden":false,"merged":[]}
[null," "]
["",{"$f":"+Inputs!$F$3","v":"Enter event name here…"}]
["","Rider Payout Signatures"]
[""]
[{"$f":"+A21","v":"||"},{"$f":"+PrizeList!B6","v":"Pro/1/2"}]
[{"$f":"IF(C6,\"\",\"||\")","v":"||"},1,{"$f":"+PrizeList!H$6","v":0}]
[{"$f":"IF(C7,\"\",\"||\")","v":"||"},{"$f":"B6+1","v":2},{"$f":"+PrizeList!I$6","v":0}]
["||",3,{"$f":"+PrizeList!J$6","v":0}]
["||",4,{"$f":"+PrizeList!K$6","v":0}]
["||",5,{"$f":"+PrizeList!L$6","v":0}]
["||",6,{"$f":"+PrizeList!M$6","v":0}]
["||",7,{"$f":"+PrizeList!N$6","v":0}]
["||",8,{"$f":"+PrizeList!O$6","v":0}]
["||",{"$f":"B13+1","v":9},{"$f":"+PrizeList!P$6","v":0}]
["||",10,{"$f":"+PrizeList!Q$6","v":0}]
["||",11,{"$f":"+PrizeList!R$6","v":0}]
["||",12,{"$f":"+PrizeList!S$6","v":0}]
["||",13,{"$f":"+PrizeList!T$6","v":0}]
["||",14,{"$f":"+PrizeList!U$6","v":0}]
["||",15,{"$f":"+PrizeList!V$6","v":0}]
["||",null,{"$f":"SUM(C6:C20)","v":0}]
[{"$f":"+A21","v":"||"}]
[{"$f":"+A39","v":"||"},{"$f":"+PrizeList!B7","v":"Cat 2 Bonus"}]
[{"$f":"IF(C24,\"\",\"||\")","v":"||"},1,{"$f":"+PrizeList!H$7","v":0}]
[{"$f":"IF(C25,\"\",\"||\")","v":"||"},{"$f":"B24+1","v":2},{"$f":"+PrizeList!I$7","v":0}]
["||",3,{"$f":"+PrizeList!J$7","v":0}]
["||",4,{"$f":"+PrizeList!K$7","v":0}]
["||",5,{"$f":"+PrizeList!L$7","v":0}]
["||",6,{"$f":"+PrizeList!M$7","v":0}]
["||",7,{"$f":"+PrizeList!N$7","v":0}]
{"$rows_left_out":187}
{"sheet":"MailMerge","index":5,"n_rows":166,"n_cols":4,"rows_kept":166,"cut":false,"hidden":false,"merged":[]}
["Event","Category","Place","Payout"]
[{"$f":"+Signatures!$B$2","v":"Enter event name here…"},{"$f":"+Signatures!B5","v":"Pro/1/2"},{"$f":"+Signatures!B6","v":1},{"$f":"+Signatures!C6","v":0}]
[{"$f":"+Signatures!$B$2","v":"Enter event name here…"},{"$f":"+B2","v":"Pro/1/2"},{"$f":"+Signatures!B7","v":2},{"$f":"+Signatures!C7","v":0}]
[{"$f":"+Signatures!$B$2","v":"Enter event name here…"},{"$f":"+B3","v":"Pro/1/2"},{"$f":"+Signatures!B8","v":3},{"$f":"+Signatures!C8","v":0}]
[{"$f":"+Signatures!$B$2","v":"Enter event name here…"},"Pro/1/2",{"$f":"+Signatures!B9","v":4},{"$f":"+Signatures!C9","v":0}]
[{"$f":"+Signatures!$B$2","v":"Enter event name here…"},"Pro/1/2",{"$f":"+Signatures!B10","v":5},{"$f":"+Signatures!C10","v":0}]
[{"$f":"+Signatures!$B$2","v":"Enter event name here…"},"Pro/1/2",{"$f":"+Signatures!B11","v":6},{"$f":"+Signatures!C11","v":0}]
[{"$f":"+Signatures!$B$2","v":"Enter event name here…"},"Pro/1/2",{"$f":"+Signatures!B12","v":7},{"$f":"+Signatures!C12","v":0}]
[{"$f":"+Signatures!$B$2","v":"Enter event name here…"},"Pro/1/2",{"$f":"+Signatures!B13","v":8},{"$f":"+Signatures!C13","v":0}]
[{"$f":"+Signatures!$B$2","v":"Enter event name here…"},"Pro/1/2",{"$f":"+Signatures!B14","v":9},{"$f":"+Signatures!C14","v":0}]
[{"$f":"+Signatures!$B$2","v":"Enter event name here…"},"Pro/1/2",{"$f":"+Signatures!B15","v":10},{"$f":"+Signatures!C15","v":0}]
[{"$f":"+Signatures!$B$2","v":"Enter event name here…"},"Pro/1/2",{"$f":"+Signatures!B16","v":11},{"$f":"+Signatures!C16","v":0}]
[{"$f":"+Signatures!$B$2","v":"Enter event name here…"},"Pro/1/2",{"$f":"+Signatures!B17","v":12},{"$f":"+Signatures!C17","v":0}]
[{"$f":"+Signatures!$B$2","v":"Enter event name here…"},"Pro/1/2",{"$f":"+Signatures!B18","v":13},{"$f":"+Signatures!C18","v":0}]
[{"$f":"+Signatures!$B$2","v":"Enter event name here…"},"Pro/1/2",{"$f":"+Signatures!B19","v":14},{"$f":"+Signatures!C19","v":0}]
[{"$f":"+Signatures!$B$2","v":"Enter event name here…"},"Pro/1/2",{"$f":"+Signatures!B20","v":15},{"$f":"+Signatures!C20","v":0}]
[{"$f":"+Signatures!$B$2","v":"Enter event name here…"},{"$f":"+Signatures!B23","v":"Cat 2 Bonus"},{"$f":"+Signatures!B24","v":1},{"$f":"+Signatures!C24","v":0}]
[{"$f":"+Signatures!$B$2","v":"Enter event name here…"},{"$f":"+B17","v":"Cat 2 Bonus"},{"$f":"+Signatures!B25","v":2},{"$f":"+Signatures!C25","v":0}]
[{"$f":"+Signatures!$B$2","v":"Enter event name here…"},"Cat 2 Bonus",{"$f":"+Signatures!B26","v":3},{"$f":"+Signatures!C26","v":0}]
[{"$f":"+Signatures!$B$2","v":"Enter event name here…"},"Cat 2 Bonus",{"$f":"+Signatures!B27","v":4},{"$f":"+Signatures!C27","v":0}]
[{"$f":"+Signatures!$B$2","v":"Enter event name here…"},"Cat 2 Bonus",{"$f":"+Signatures!B28","v":5},{"$f":"+Signatures!C28","v":0}]
[{"$f":"+Signatures!$B$2","v":"Enter event name here…"},"Cat 2 Bonus",{"$f":"+Signatures!B29","v":6},{"$f":"+Signatures!C29","v":0}]
[{"$f":"+Signatures!$B$2","v":"Enter event name here…"},"Cat 2 Bonus",{"$f":"+Signatures!B30","v":7},{"$f":"+Signatures!C30","v":0}]
[{"$f":"+Signatures!$B$2","v":"Enter event name here…"},"Cat 2 Bonus",{"$f":"+Signatures!B31","v":8},{"$f":"+Signatures!C31","v":0}]
[{"$f":"+Signatures!$B$2","v":"Enter event name here…"},"Cat 2 Bonus",{"$f":"+Signatures!B32","v":9},{"$f":"+Signatures!C32","v":0}]
[{"$f":"+Signatures!$B$2","v":"Enter event name here…"},"Cat 2 Bonus",{"$f":"+Signatures!B33","v":10},{"$f":"+Signatures!C33","v":0}]
[{"$f":"+Signatures!$B$2","v":"Enter event name here…"},"Cat 2 Bonus",{"$f":"+Signatures!B34","v":11},{"$f":"+Signatures!C34","v":0}]
[{"$f":"+Signatures!$B$2","v":"Enter event name here…"},"Cat 2 Bonus",{"$f":"+Signatures!B35","v":12},{"$f":"+Signatures!C35","v":0}]
[{"$f":"+Signatures!$B$2","v":"Enter event name here…"},"Cat 2 Bonus",{"$f":"+Signatures!B36","v":13},{"$f":"+Signatures!C36","v":0}]
[{"$f":"+Signatures!$B$2","v":"Enter event name here…"},"Cat 2 Bonus",{"$f":"+Signatures!B37","v":14},{"$f":"+Signatures!C37","v":0}]
{"$rows_left_out":137}
{"sheet":"Bank_Table","index":6,"n_rows":22,"n_cols":5,"rows_kept":22,"cut":false,"hidden":true,"merged":[]}
[]
[null,null,20,10,5]
[null,95,4,1,1]
[null,{"$f":"+B3-5","v":90},4,1,0]
[null,{"$f":"+B4-5","v":85},4,0,1]
[null,80,4,0,0]
[null,75,3,1,1]
[null,70,3,1,0]
[null,65,3,0,1]
[null,60,3,0,0]
[null,55,2,1,1]
[null,50,2,1,0]
[null,45,2,0,1]
[null,40,2,0,0]
[null,35,1,1,1]
[null,30,1,1,0]
[null,25,1,0,1]
[null,20,1,0,0]
[null,15,0,1,1]
[null,10,0,1,0]
[null,5,0,0,1]
[null,0,0,0,0]

{"sheet":"Bank_Exhibit","index":7,"n_rows":8,"n_cols":4,"rows_kept":8,"cut":false,"hidden":false,"merged":[]}
[]
[]
[]
[null,"Denomination","Quantity","Amount"]
[null,{"$f":"+Bank_Calc!C4","v":20},{"$f":"+Bank_Calc!C2","v":0},{"$f":"+B5*C5","v":0}]
[null,{"$f":"+Bank_Calc!D4","v":10},{"$f":"+Bank_Calc!D2","v":0},{"$f":"+B6*C6","v":0}]
[null,{"$f":"+Bank_Calc!E4","v":5},{"$f":"+Bank_Calc!E2","v":0},{"$f":"+B7*C7","v":0}]
[null,"Total:",null,{"$f":"SUM(D5:D7)","v":0}]

{"sheet":"Bank_Calc","index":8,"n_rows":169,"n_cols":5,"rows_kept":169,"cut":false,"hidden":false,"merged":[]}
["*** Internal Calculations (Ignore) ***"]
["Quantity Total:",null,{"$f":"SUM(C5:C169)","v":0},{"$f":"SUM(D5:D169)","v":0},{"$f":"SUM(E5:E169)","v":0}]
[]
["Payout",100,20,10,5]
[{"$f":"+MailMerge!D2","v":0},{"$f":"INT(A5/B$4)*B$4","v":0},{"$f":"+$B5/C$4+VLOOKUP($A5-$B5,Bank_Table!$B$3:$E$22,2,FALSE)","v":0},{"$f":"VLOOKUP($A5-$B5,Bank_Table!$B$3:$E$22,3,FALSE)","v":0},{"$f":"VLOOKUP($A5-$B5,Bank_Table!$B$3:$E$22,4,FALSE)","v":0}]
[{"$f":"+MailMerge!D3","v":0},{"$f":"INT(A6/B$4)*B$4","v":0},{"$f":"+$B6/C$4+VLOOKUP($A6-$B6,Bank_Table!$B$3:$E$22,2,FALSE)","v":0},{"$f":"VLOOKUP($A6-$B6,Bank_Table!$B$3:$E$22,3,FALSE)","v":0},{"$f":"VLOOKUP($A6-$B6,Bank_Table!$B$3:$E$22,4,FALSE)","v":0}]
[{"$f":"+MailMerge!D4","v":0},0,{"$f":"+$B7/C$4+VLOOKUP($A7-$B7,Bank_Table!$B$3:$E$22,2,FALSE)","v":0},{"$f":"VLOOKUP($A7-$B7,Bank_Table!$B$3:$E$22,3,FALSE)","v":0},{"$f":"VLOOKUP($A7-$B7,Bank_Table!$B$3:$E$22,4,FALSE)","v":0}]
[{"$f":"+MailMerge!D5","v":0},0,{"$f":"+$B8/C$4+VLOOKUP($A8-$B8,Bank_Table!$B$3:$E$22,2,FALSE)","v":0},{"$f":"VLOOKUP($A8-$B8,Bank_Table!$B$3:$E$22,3,FALSE)","v":0},{"$f":"VLOOKUP($A8-$B8,Bank_Table!$B$3:$E$22,4,FALSE)","v":0}]
[{"$f":"+MailMerge!D6","v":0},0,{"$f":"+$B9/C$4+VLOOKUP($A9-$B9,Bank_Table!$B$3:$E$22,2,FALSE)","v":0},{"$f":"VLOOKUP($A9-$B9,Bank_Table!$B$3:$E$22,3,FALSE)","v":0},{"$f":"VLOOKUP($A9-$B9,Bank_Table!$B$3:$E$22,4,FALSE)","v":0}]
[{"$f":"+MailMerge!D7","v":0},0,{"$f":"+$B10/C$4+VLOOKUP($A10-$B10,Bank_Table!$B$3:$E$22,2,FALSE)","v":0},{"$f":"VLOOKUP($A10-$B10,Bank_Table!$B$3:$E$22,3,FALSE)","v":0},{"$f":"VLOOKUP($A10-$B10,Bank_Table!$B$3:$E$22,4,FALSE)","v":0}]
[{"$f":"+MailMerge!D8","v":0},0,{"$f":"+$B11/C$4+VLOOKUP($A11-$B11,Bank_Table!$B$3:$E$22,2,FALSE)","v":0},{"$f":"VLOOKUP($A11-$B11,Bank_Table!$B$3:$E$22,3,FALSE)","v":0},{"$f":"VLOOKUP($A11-$B11,Bank_Table!$B$3:$E$22,4,FALSE)","v":0}]
[{"$f":"+MailMerge!D9","v":0},0,{"$f":"+$B12/C$4+VLOOKUP($A12-$B12,Bank_Table!$B$3:$E$22,2,FALSE)","v":0},{"$f":"VLOOKUP($A12-$B12,Bank_Table!$B$3:$E$22,3,FALSE)","v":0},{"$f":"VLOOKUP($A12-$B12,Bank_Table!$B$3:$E$22,4,FALSE)","v":0}]
[{"$f":"+MailMerge!D10","v":0},0,{"$f":"+$B13/C$4+VLOOKUP($A13-$B13,Bank_Table!$B$3:$E$22,2,FALSE)","v":0},{"$f":"VLOOKUP($A13-$B13,Bank_Table!$B$3:$E$22,3,FALSE)","v":0},{"$f":"VLOOKUP($A13-$B13,Bank_Table!$B$3:$E$22,4,FALSE)","v":0}]
[{"$f":"+MailMerge!D11","v":0},0,{"$f":"+$B14/C$4+VLOOKUP($A14-$B14,Bank_Table!$B$3:$E$22,2,FALSE)","v":0},{"$f":"VLOOKUP($A14-$B14,Bank_Table!$B$3:$E$22,3,FALSE)","v":0},{"$f":"VLOOKUP($A14-$B14,Bank_Table!$B$3:$E$22,4,FALSE)","v":0}]
[{"$f":"+MailMerge!D12","v":0},0,{"$f":"+$B15/C$4+VLOOKUP($A15-$B15,Bank_Table!$B$3:$E$22,2,FALSE)","v":0},{"$f":"VLOOKUP($A15-$B15,Bank_Table!$B$3:$E$22,3,FALSE)","v":0},{"$f":"VLOOKUP($A15-$B15,Bank_Table!$B$3:$E$22,4,FALSE)","v":0}]
[{"$f":"+MailMerge!D13","v":0},0,{"$f":"+$B16/C$4+VLOOKUP($A16-$B16,Bank_Table!$B$3:$E$22,2,FALSE)","v":0},{"$f":"VLOOKUP($A16-$B16,Bank_Table!$B$3:$E$22,3,FALSE)","v":0},{"$f":"VLOOKUP($A16-$B16,Bank_Table!$B$3:$E$22,4,FALSE)","v":0}]
[{"$f":"+MailMerge!D14","v":0},0,{"$f":"+$B17/C$4+VLOOKUP($A17-$B17,Bank_Table!$B$3:$E$22,2,FALSE)","v":0},{"$f":"VLOOKUP($A17-$B17,Bank_Table!$B$3:$E$22,3,FALSE)","v":0},{"$f":"VLOOKUP($A17-$B17,Bank_Table!$B$3:$E$22,4,FALSE)","v":0}]
[{"$f":"+MailMerge!D15","v":0},0,{"$f":"+$B18/C$4+VLOOKUP($A18-$B18,Bank_Table!$B$3:$E$22,2,FALSE)","v":0},{"$f":"VLOOKUP($A18-$B18,Bank_Table!$B$3:$E$22,3,FALSE)","v":0},{"$f":"VLOOKUP($A18-$B18,Bank_Table!$B$3:$E$22,4,FALSE)","v":0}]
[{"$f":"+MailMerge!D16","v":0},0,{"$f":"+$B19/C$4+VLOOKUP($A19-$B19,Bank_Table!$B$3:$E$22,2,FALSE)","v":0},{"$f":"VLOOKUP($A19-$B19,Bank_Table!$B$3:$E$22,3,FALSE)","v":0},{"$f":"VLOOKUP($A19-$B19,Bank_Table!$B$3:$E$22,4,FALSE)","v":0}]
[{"$f":"+MailMerge!D17","v":0},0,{"$f":"+$B20/C$4+VLOOKUP($A20-$B20,Bank_Table!$B$3:$E$22,2,FALSE)","v":0},{"$f":"VLOOKUP($A20-$B20,Bank_Table!$B$3:$E$22,3,FALSE)","v":0},{"$f":"VLOOKUP($A20-$B20,Bank_Table!$B$3:$E$22,4,FALSE)","v":0}]
[{"$f":"+MailMerge!D18","v":0},0,{"$f":"+$B21/C$4+VLOOKUP($A21-$B21,Bank_Table!$B$3:$E$22,2,FALSE)","v":0},{"$f":"VLOOKUP($A21-$B21,Bank_Table!$B$3:$E$22,3,FALSE)","v":0},{"$f":"VLOOKUP($A21-$B21,Bank_Table!$B$3:$E$22,4,FALSE)","v":0}]
[{"$f":"+MailMerge!D19","v":0},0,{"$f":"+$B22/C$4+VLOOKUP($A22-$B22,Bank_Table!$B$3:$E$22,2,FALSE)","v":0},{"$f":"VLOOKUP($A22-$B22,Bank_Table!$B$3:$E$22,3,FALSE)","v":0},{"$f":"VLOOKUP($A22-$B22,Bank_Table!$B$3:$E$22,4,FALSE)","v":0}]
[{"$f":"+MailMerge!D20","v":0},0,{"$f":"+$B23/C$4+VLOOKUP($A23-$B23,Bank_Table!$B$3:$E$22,2,FALSE)","v":0},{"$f":"VLOOKUP($A23-$B23,Bank_Table!$B$3:$E$22,3,FALSE)","v":0},{"$f":"VLOOKUP($A23-$B23,Bank_Table!$B$3:$E$22,4,FALSE)","v":0}]
[{"$f":"+MailMerge!D21","v":0},0,{"$f":"+$B24/C$4+VLOOKUP($A24-$B24,Bank_Table!$B$3:$E$22,2,FALSE)","v":0},{"$f":"VLOOKUP($A24-$B24,Bank_Table!$B$3:$E$22,3,FALSE)","v":0},{"$f":"VLOOKUP($A24-$B24,Bank_Table!$B$3:$E$22,4,FALSE)","v":0}]
[{"$f":"+MailMerge!D22","v":0},0,{"$f":"+$B25/C$4+VLOOKUP($A25-$B25,Bank_Table!$B$3:$E$22,2,FALSE)","v":0},{"$f":"VLOOKUP($A25-$B25,Bank_Table!$B$3:$E$22,3,FALSE)","v":0},{"$f":"VLOOKUP($A25-$B25,Bank_Table!$B$3:$E$22,4,FALSE)","v":0}]
[{"$f":"+MailMerge!D23","v":0},0,{"$f":"+$B26/C$4+VLOOKUP($A26-$B26,Bank_Table!$B$3:$E$22,2,FALSE)","v":0},{"$f":"VLOOKUP($A26-$B26,Bank_Table!$B$3:$E$22,3,FALSE)","v":0},{"$f":"VLOOKUP($A26-$B26,Bank_Table!$B$3:$E$22,4,FALSE)","v":0}]
[{"$f":"+MailMerge!D24","v":0},0,{"$f":"+$B27/C$4+VLOOKUP($A27-$B27,Bank_Table!$B$3:$E$22,2,FALSE)","v":0},{"$f":"VLOOKUP($A27-$B27,Bank_Table!$B$3:$E$22,3,FALSE)","v":0},{"$f":"VLOOKUP($A27-$B27,Bank_Table!$B$3:$E$22,4,FALSE)","v":0}]
[{"$f":"+MailMerge!D25","v":0},0,{"$f":"+$B28/C$4+VLOOKUP($A28-$B28,Bank_Table!$B$3:$E$22,2,FALSE)","v":0},{"$f":"VLOOKUP($A28-$B28,Bank_Table!$B$3:$E$22,3,FALSE)","v":0},{"$f":"VLOOKUP($A28-$B28,Bank_Table!$B$3:$E$22,4,FALSE)","v":0}]
[{"$f":"+MailMerge!D26","v":0},0,{"$f":"+$B29/C$4+VLOOKUP($A29-$B29,Bank_Table!$B$3:$E$22,2,FALSE)","v":0},{"$f":"VLOOKUP($A29-$B29,Bank_Table!$B$3:$E$22,3,FALSE)","v":0},{"$f":"VLOOKUP($A29-$B29,Bank_Table!$B$3:$E$22,4,FALSE)","v":0}]
[{"$f":"+MailMerge!D27","v":0},0,{"$f":"+$B30/C$4+VLOOKUP($A30-$B30,Bank_Table!$B$3:$E$22,2,FALSE)","v":0},{"$f":"VLOOKUP($A30-$B30,Bank_Table!$B$3:$E$22,3,FALSE)","v":0},{"$f":"VLOOKUP($A30-$B30,Bank_Table!$B$3:$E$22,4,FALSE)","v":0}]
{"$rows_left_out":139}